BDBM6021 6-(3,4-Dihydroxybenzyl)-3-ethyl-1-(2,4,6-trichlorophenyl)-4,5-dihydro-1H-pyrazolo[3,4-d]pyrimidin-4-one::6-[(3,4-dihydroxyphenyl)methyl]-3-ethyl-1-(2,4,6-trichlorophenyl)-1H,4H,5H-pyrazolo[3,4-d]pyrimidin-4-one::pyrazolo[3,4-d]pyrimidin-4-one deriv. 22s
SMILES CCc1nn(-c2c(Cl)cc(Cl)cc2Cl)c2nc(Cc3ccc(O)c(O)c3)[nH]c(=O)c12
InChI Key InChIKey=OPRAIFVPXXVXDL-UHFFFAOYSA-N
Data  3 IC50
PDB links: 1 PDB ID matches this monomer.
  Tab Delimited (TSV)   2D SDfile   Computed 3D by Vconf -m prep SDfile
Find this compound or compounds like it in BindingDB:
Activity Spreadsheet -- Enzyme Inhibition Constant Data from BindingDB
Found 1 hit for monomerid = 6021
TargetCyclin-dependent kinase 2/G1/S-specific cyclin-E1(Homo sapiens (Human))
Bristol-Myers Squibb
LigandPNGBDBM6021(6-(3,4-Dihydroxybenzyl)-3-ethyl-1-(2,4,6-trichloro...)
Affinity DataIC50:  20nM. Assay description: The enzyme was assayed with substrate GST-Rb in the presence of 50 uM ATP/[gamma-32P] ATP, and capturing the 32-P labeled reaction products on GSH-Se...